{"text_format":"1","workbook":"xlsx","n_sheets":3,"sheets":["ADHC ATB SUMMARY","1-1-24 ADHC rates","2024 ADHC  Salient days"],"not_rendered":{"charts":0,"images":0,"macros":1,"external_links":9,"defined_names":41,"comments":0,"pivot_tables":0},"unopened":[],"bounds":{"document_bytes":16777216,"sheet_cells":100000,"rows_first":2000,"rows_last":500,"rows_between":2000,"halvings":0,"cell_chars":16384,"cell_head_chars":4096},"cells_cut":0,"cells_raw":0,"read":"whole","date_system":"1900"}

{"sheet":"ADHC ATB SUMMARY","index":0,"n_rows":62,"n_cols":4,"rows_kept":62,"cut":false,"hidden":false,"merged":[[0,0,0,3],[1,0,1,3],[2,0,2,3]]}
["New York State Department of Health"]
["Division of Finance and Rate Setting"]
["SFY 2026 ATB State Share Payment for ADHC"]
[]
[]
[null,null,5975067.3500000006,2987533.6750000003]
["Opcert","Name","Gross Total","State Share"]
["700235653","Amsterdam Nursing Home Corp (amsterdam House)",5745.74,2872.87]
["700031954","Bainbridge Nursing And Rehabilitation Center",416847.41,208423.70499999999]
["515731853","Brookside Multicare Nursing Center",138118.75,69059.375]
["700136453","Bushwick Center for Rehabilitation and Health Care",43675.66,21837.83]
["700136454","Bushwick Center for Rehabilitation and Health Care",25795.56,12897.78]
["322730453","Charles T Sitrin Health Care Center Inc",165220.16,82610.080000000002]
["295231053","Cold Spring Hills Center for Nursing and Rehabilitation",240577.75,120288.875]
["110130663","Cortland Regional Nursing and Rehabilitation Center",57859.199999999997,28929.599999999999]
["262330056","Crouse Community Center Inc",55147.05,27573.525000000001]
["262330053","Crouse Community Center Inc",29713.11,14856.555]
["262330054","Crouse Community Center Inc",18703.79,9351.8950000000004]
["700138053","Dr Susan Smith Mckinney Nursing and Rehabilitation Center",32947.599999999999,16473.8]
["532030253","Elderwood at Waverly",34193.18,17096.59]
["212430053","Foltsbrook Center for Nursing and Rehabilitation",37086.14,18543.07]
["572430253","Fort Hudson Nursing Center Inc",54745.25,27372.625]
["700180853","Four Seasons Nursing and Rehabilitation Center",450779.42,225389.71]
["700180854","Four Seasons Nursing and Rehabilitation Center",330420.23,165210.11499999999]
["700340253","Franklin Center for Rehabilitation and Nursing",116763.08,58381.54]
["435030553","Friedwald Center for Rehabilitation & Nursing LLC",131629.68,65814.84]
["515330753","Gurwin Jewish Nursing and Rehabilitation Center",398505.24,199252.62]
["295130653","Highfield Gardens Care Center of Great Neck",153648.32000000001,76824.160000000003]
["275030453","Jewish Home & Infirmary Of Rochester Ny Inc",346030.16,173015.08]
["330130953","Jewish Home Of Central New York",97094.97,48547.485000000001]
["252230053","Livingston County Center for Nursing and Rehabilitatio",1165.22,582.61]
["515131053","Long Island State Veterans Home",32646.25,16323.125]
["515432953","Maria Regina Residence Inc",33007.870000000003,16503.935000000001]
["322730553","MVHS Rehabilitation and Nursing Center",7413.21,3706.605]
["435330153","Northern Metropolitan Residential Health Care Facility Inc",80319.820000000007,40159.910000000003]
["320231753","Oneida Center for Rehabilitation and Nursing",76763.89,38381.945]
["700139153","Palm Gardens Care Center LLC",89420.59,44710.294999999998]
["700139154","Palm Gardens Care Center LLC",9683.3799999999992,4841.6899999999996]
["090130453","Plattsburgh Rehabilitation and Nursing Center",65714.39,32857.195]
["322730353","Presbyterian Home For Central New York Inc",23605.75,11802.875]
{"$rows_left_out":23}
{"sheet":"1-1-24 ADHC rates","index":1,"n_rows":161,"n_cols":16,"rows_kept":161,"cut":false,"hidden":true,"merged":[[0,0,0,12]]}
["January 1, 2024 ADHC Initial Rates"]
[1,2,3,4,5,6,7,8,9,10,11,12,13,"9-6"]
["Organization","LOC CODE","Name","Date","Operating Per Diem","Capital with 5% capital reduction","Operating + Capital Rate","Combined Rate Ceiling","Lower of Rate or Ceiling","1.5% Add-On","1% add-on","7.5% add -on","Initial Jan 1, 2024 Rate","Operating rate ","Op rate from other sheet"]
["700235653","03","Amsterdam Nursing Home Corp (amsterdam House)","2024-01-01",126.13,9.83,{"$f":"+E4+F4","v":135.96},147.36000000000001,{"$f":"IF(G4<H4,G4,H4)","v":135.96},{"$f":"ROUND(+E4*0.015,2)","v":1.89},{"$f":"ROUND((+E4+J4)*0.01,2)","v":1.28},{"$f":"ROUND(+(E4+J4+K4)*0.075,2)","v":9.6999999999999993},{"$f":"SUM(I4:L4)","v":148.82999999999998},{"$f":"I4-F4","v":126.13000000000001},{"$f":"VLOOKUP(A4,#REF!,4,FALSE)","v":{"$error":"#REF!"}},{"$f":"O4=O4","v":{"$error":"#REF!"}}]
["700031954","04","Bainbridge Nursing And Rehabilitation Center","2024-01-01",91.55,1.25,{"$f":"+E5+F5","v":92.8},127.85,92.8,1.37,0.93,7.04,102.14000000000001,{"$f":"I5-F5","v":91.55},{"$f":"VLOOKUP(A5,#REF!,4,FALSE)","v":{"$error":"#REF!"}},{"$f":"O5=O5","v":{"$error":"#REF!"}}]
["592130353","03","Bethel Nursing and Rehabilitation Center","2024-01-01",122.78,2.64,{"$f":"+E6+F6","v":125.42},127.63,125.42,1.84,1.25,9.44,137.94999999999999,122.78,{"$f":"VLOOKUP(A6,#REF!,4,FALSE)","v":{"$error":"#REF!"}},{"$error":"#REF!"}]
["515731853","03","Brookside Multicare Nursing Center","2024-01-01",119.77,8.26,128.03,128.15,128.03,1.8,1.22,9.2100000000000009,140.26000000000002,119.77,{"$f":"VLOOKUP(A7,#REF!,4,FALSE)","v":{"$error":"#REF!"}},{"$error":"#REF!"}]
["700136454","04","Bushwick Center for Rehabilitation and Health Care","2024-01-01",102.67,14.69,117.36,137.22999999999999,117.36,1.54,1.04,7.89,127.83000000000001,102.67,{"$f":"VLOOKUP(A8,#REF!,4,FALSE)","v":{"$error":"#REF!"}},{"$error":"#REF!"}]
["700136453","03","Bushwick Center for Rehabilitation and Health Care","2024-01-01",84.72,12.07,96.789999999999992,137.22999999999999,96.789999999999992,1.27,0.86,6.51,105.42999999999999,84.72,{"$f":"VLOOKUP(A9,#REF!,4,FALSE)","v":{"$error":"#REF!"}},{"$error":"#REF!"}]
["322730453","03","Charles T Sitrin Health Care Center Inc","2024-01-01",88.31,11.01,99.320000000000007,100.39,99.320000000000007,1.32,0.9,6.79,108.33000000000001,88.31,{"$f":"VLOOKUP(A10,#REF!,4,FALSE)","v":{"$error":"#REF!"}},{"$error":"#REF!"}]
["295231053","03","Cold Spring Hills Center for Nursing and Rehabilitation","2024-01-01",133.4,6.45,139.85,140.69,139.85,2,1.35,10.26,153.45999999999998,133.4,{"$f":"VLOOKUP(A11,#REF!,4,FALSE)","v":{"$error":"#REF!"}},{"$error":"#REF!"}]
["110130663","03","Cortland Regional Nursing and Rehabilitation Center","2024-01-01",402.64,9.14,411.78,95.65,95.65,6.04,4.09,30.96,136.74,86.51,{"$f":"VLOOKUP(A12,#REF!,4,FALSE)","v":{"$error":"#REF!"}},{"$error":"#REF!"}]
["262330057","07","Crouse Community Center Inc (New Unit)","2024-01-01",103.2,4.92,108.12,107.1,107.1,1.55,1.05,7.94,117.63999999999999,102.17999999999999,{"$f":"VLOOKUP(A13,#REF!,4,FALSE)","v":{"$error":"#REF!"}},{"$error":"#REF!"}]
["262330056","06","Crouse Community Center Inc","2024-01-01",86.18,5.95,92.13000000000001,107.1,92.13000000000001,1.29,0.87,6.63,100.92000000000002,86.18,{"$f":"VLOOKUP(A14,#REF!,4,FALSE)","v":{"$error":"#REF!"}},{"$error":"#REF!"}]
["700138054","04","Dr Susan Smith Mckinney Nursing and Rehabilitation Center","2024-01-01",151,{"$f":"ROUND(12.02*0.95,2)","v":11.42},162.41999999999999,147.27000000000001,147.27000000000001,2.27,1.53,11.61,162.68,135.85000000000002,{"$f":"VLOOKUP(A15,#REF!,4,FALSE)","v":{"$error":"#REF!"}},{"$error":"#REF!"}]
["700138053","03","Dr Susan Smith Mckinney Nursing and Rehabilitation Center","2024-01-01",103.51,{"$f":"ROUND(40.3*0.95,2)","v":38.29},141.80000000000001,147.27000000000001,141.80000000000001,1.55,1.05,7.96,152.36000000000004,103.51000000000002,{"$f":"VLOOKUP(A16,#REF!,4,FALSE)","v":{"$error":"#REF!"}},{"$error":"#REF!"}]
["532030253","03","Elderwood at Waverly","2024-01-01",90.94,8.81,99.75,117.11,99.75,1.36,0.92,6.99,109.02,90.94,{"$f":"VLOOKUP(A17,#REF!,4,FALSE)","v":{"$error":"#REF!"}},{"$error":"#REF!"}]
["700337553","03","Fairview Nursing Care Center Inc","2024-01-01",91.92,2.75,94.67,142.96,94.67,1.38,0.93,7.07,104.05000000000001,91.92,{"$f":"VLOOKUP(A18,#REF!,4,FALSE)","v":{"$error":"#REF!"}},{"$error":"#REF!"}]
["212430053","03","Foltsbrook Center for Nursing and Rehabilitation","2024-01-01",66.36,9.8000000000000007,76.16,90.65,76.16,1,0.67,5.0999999999999996,82.929999999999993,66.36,{"$f":"VLOOKUP(A19,#REF!,4,FALSE)","v":{"$error":"#REF!"}},{"$error":"#REF!"}]
["572430253","03","Fort Hudson Nursing Center Inc","2024-01-01",87.67,8.58,96.25,96.89,96.25,1.32,0.89,6.74,105.19999999999999,87.67,{"$f":"VLOOKUP(A20,#REF!,4,FALSE)","v":{"$error":"#REF!"}},{"$error":"#REF!"}]
["700180854","04","Four Seasons Nursing and Rehabilitation Center","2024-01-01",95.15,3.93,99.080000000000013,134.07,99.080000000000013,1.43,0.97,7.32,108.80000000000001,95.15,{"$f":"VLOOKUP(A21,#REF!,4,FALSE)","v":{"$error":"#REF!"}},{"$error":"#REF!"}]
["700180853","03","Four Seasons Nursing and Rehabilitation Center","2024-01-01",86.48,2.4500000000000002,88.93,134.07,88.93,1.3,0.88,6.65,97.76,86.48,{"$f":"VLOOKUP(A22,#REF!,4,FALSE)","v":{"$error":"#REF!"}},{"$error":"#REF!"}]
["700340253","03","Franklin Center for Rehabilitation and Nursing","2024-01-01",95.13,15.43,110.56,132.51,110.56,1.43,0.97,7.31,120.27000000000001,95.13,{"$f":"VLOOKUP(A23,#REF!,4,FALSE)","v":{"$error":"#REF!"}},{"$error":"#REF!"}]
["435030553","03","Friedwald Center for Rehabilitation & Nursing LLC","2024-01-01",88.8,7.01,95.81,83.08,83.08,1.33,0.9,6.83,92.14,76.069999999999993,{"$f":"VLOOKUP(A24,#REF!,4,FALSE)","v":{"$error":"#REF!"}},{"$error":"#REF!"}]
["515330753","03","Gurwin Jewish Nursing and Rehabilitation Center","2024-01-01",131.69,6.24,137.93,178.29,137.93,1.98,1.34,10.130000000000001,151.38,131.69,{"$f":"VLOOKUP(A25,#REF!,4,FALSE)","v":{"$error":"#REF!"}},{"$error":"#REF!"}]
["295130653","03","Highfield Gardens Care Center of Great Neck","2024-01-01",99.48,10.82,110.30000000000001,147.47999999999999,110.30000000000001,1.49,1.01,7.65,120.45000000000002,99.480000000000018,{"$f":"VLOOKUP(A26,#REF!,4,FALSE)","v":{"$error":"#REF!"}},{"$error":"#REF!"}]
["275030453","03","Jewish Home & Infirmary Of Rochester Ny Inc","2024-01-01",111.45,21.48,132.93,118.1,118.1,1.67,1.1299999999999999,8.57,129.47,96.61999999999999,{"$f":"VLOOKUP(A27,#REF!,4,FALSE)","v":{"$error":"#REF!"}},{"$error":"#REF!"}]
["330130953","03","Jewish Home Of Central New York","2024-01-01",70.5,5.14,75.64,101.83,75.64,1.06,0.72,5.42,82.84,70.5,{"$f":"VLOOKUP(A28,#REF!,4,FALSE)","v":{"$error":"#REF!"}},{"$error":"#REF!"}]
["515131053","03","Long Island State Veterans Home","2024-01-01",151.19,9.2200000000000006,160.41,140.22,140.22,2.27,1.53,11.62,155.64000000000001,131,{"$f":"VLOOKUP(A29,#REF!,4,FALSE)","v":{"$error":"#REF!"}},{"$error":"#REF!"}]
["130230653","03","Lutheran Center at Poughkeepsie Inc","2024-01-01",149.57,18.3,167.87,105.53,105.53,2.2400000000000002,1.52,11.5,120.78999999999999,87.23,{"$f":"VLOOKUP(A30,#REF!,4,FALSE)","v":{"$error":"#REF!"}},{"$error":"#REF!"}]
["515432953","03","Maria Regina Residence Inc","2024-01-01",187.12,7.96,195.08,140.16,140.16,2.81,1.9,14.39,159.26,132.19999999999999,{"$f":"VLOOKUP(A31,#REF!,4,FALSE)","v":{"$error":"#REF!"}},{"$error":"#REF!"}]
["322730553","03","MVHS Rehabilitation and Nursing Center","2024-01-01",88.8,11.57,100.37,120.9,100.37,1.33,0.9,6.83,109.43,88.800000000000011,{"$f":"VLOOKUP(A32,#REF!,4,FALSE)","v":{"$error":"#REF!"}},{"$error":"#REF!"}]
["435330153","03","Northern Metropolitan Residential Health Care Facility Inc","2024-01-01",118.71,23.22,141.93,143.76,141.93,1.78,1.2,9.1300000000000008,154.04,118.71000000000001,{"$f":"VLOOKUP(A33,#REF!,4,FALSE)","v":{"$error":"#REF!"}},{"$error":"#REF!"}]
["320231753","03","Oneida Center for Rehabilitation and Nursing","2024-01-01",72.900000000000006,1.9,74.800000000000011,95.47,74.800000000000011,1.0900000000000001,0.74,5.6,82.23,72.900000000000006,{"$f":"VLOOKUP(A34,#REF!,4,FALSE)","v":{"$error":"#REF!"}},{"$error":"#REF!"}]
["700139154","04","Palm Gardens Care Center LLC","2024-01-01",100.43,2.66,103.09,138.59,103.09,1.51,1.02,7.72,113.34,100.43,{"$f":"VLOOKUP(A35,#REF!,4,FALSE)","v":{"$error":"#REF!"}},{"$error":"#REF!"}]
["700139153","03","Palm Gardens Care Center LLC","2024-01-01",82.81,9.3000000000000007,92.11,136.02000000000001,92.11,1.24,0.84,6.37,100.56,82.81,{"$f":"VLOOKUP(A36,#REF!,4,FALSE)","v":{"$error":"#REF!"}},{"$error":"#REF!"}]
["090130453","03","Plattsburgh Rehabilitation and Nursing Center","2024-01-01",81.459999999999994,7.78,89.24,97.79,89.24,1.22,0.83,6.26,97.55,81.459999999999994,{"$f":"VLOOKUP(A37,#REF!,4,FALSE)","v":{"$error":"#REF!"}},{"$error":"#REF!"}]
["322730353","03","Presbyterian Home For Central New York Inc","2024-01-01",124.21,6.56,130.76999999999998,87.95,87.95,1.86,1.26,9.5500000000000007,100.62,81.39,{"$f":"VLOOKUP(A38,#REF!,4,FALSE)","v":{"$error":"#REF!"}},{"$error":"#REF!"}]
["140430053","03","Schofield Residence","2024-01-01",135.32,5.67,140.98999999999998,92.23,92.23,2.0299999999999998,1.37,10.4,106.03000000000002,86.56,{"$f":"VLOOKUP(A39,#REF!,4,FALSE)","v":{"$error":"#REF!"}},{"$error":"#REF!"}]
["370231253","03","Seneca Hill Manor Inc","2024-01-01",77.430000000000007,4.6500000000000004,82.080000000000013,95.44,82.080000000000013,1.1599999999999999,0.79,5.95,89.980000000000018,77.430000000000007,{"$f":"VLOOKUP(A40,#REF!,4,FALSE)","v":{"$error":"#REF!"}},{"$error":"#REF!"}]
{"$rows_left_out":122}
{"sheet":"2024 ADHC  Salient days","index":2,"n_rows":160,"n_cols":13,"rows_kept":160,"cut":false,"hidden":true,"merged":[]}
["MMIS+locator code","Loc","Organization","MMIS","MMIS salient","Name","2021 Salient Days","2022 Salient days","2023 Salient data","2024 days",null,null,"Opsert"]
["29936993","3","700235653",1958263,2993699,"Amsterdam Nursing Home Corp (amsterdam House)",194,460,236,{"$f":"IFERROR(VLOOKUP(C2,[9]Summary!$C$10:$K$164,9,FALSE),0)","v":286},null,null,"700235653"]
["16314563","3","380100063",1631456,1631456,"Aurelia Osborn Fox Memorial Hospital",0,0,0,{"$f":"IFERROR(VLOOKUP(C3,[9]Summary!$C$10:$K$164,9,FALSE),0)","v":0},null,null,"380100063"]
[null,null,"132730153",null,null,"BAPTIST HOME AT BROOKMEADE",null,null,null,{"$f":"IFERROR(VLOOKUP(C4,[9]Summary!$C$10:$K$164,9,FALSE),0)","v":0}]
["15569543","3","700031953",1556954,1556954,"Bainbridge Nursing And Rehabilitation Center",0,0,0,{"$f":"IFERROR(VLOOKUP(C5,[9]Summary!$C$10:$K$164,9,FALSE),0)","v":0},null,null,"700031953"]
["15569544","4","700031954",1556954,1556954,"Bainbridge Nursing And Rehabilitation Center",11957,24759,24057,{"$f":"IFERROR(VLOOKUP(C6,[9]Summary!$C$10:$K$164,9,FALSE),0)","v":20622},null,null,"700031954"]
["14490903","3","515132153",1449090,1449090,"Bellhaven Center For Rehabilitation and Nursing Care",0,0,0,{"$f":"IFERROR(VLOOKUP(C7,[9]Summary!$C$10:$K$164,9,FALSE),0)","v":0},null,null,"515132153"]
["7914423","3","700039953",791442,791442,"Beth Abraham Center for Rehabilitation and Nursing",0,0,0,{"$f":"IFERROR(VLOOKUP(C8,[9]Summary!$C$10:$K$164,9,FALSE),0)","v":0},null,null,"700039953"]
["7914424","4","700039954",791442,791442,"Beth Abraham Center for Rehabilitation and Nursing",0,0,0,{"$f":"IFERROR(VLOOKUP(C9,[9]Summary!$C$10:$K$164,9,FALSE),0)","v":0},null,null,"700039954"]
["7914425","5","700039955",791442,791442,"Beth Abraham Center for Rehabilitation and Nursing",0,0,0,{"$f":"IFERROR(VLOOKUP(C10,[9]Summary!$C$10:$K$164,9,FALSE),0)","v":0},null,null,"700039955"]
["21440033","3","592130353",2144003,2144003,"Bethel Nursing and Rehabilitation Center",2734,1455,2525,{"$f":"IFERROR(VLOOKUP(C11,[9]Summary!$C$10:$K$164,9,FALSE),0)","v":0},null,null,"592130153"]
["3999864","4","700139454",399986,399986,"Boro Park Center for Rehabilitation and Healthcare",0,0,0,{"$f":"IFERROR(VLOOKUP(C12,[9]Summary!$C$10:$K$164,9,FALSE),0)","v":0},null,null,"700139454"]
["16176103","3","700039753",1617610,1617610,"Bronx Gardens Rehabilitation and Nursing Center",0,0,0,{"$f":"IFERROR(VLOOKUP(C13,[9]Summary!$C$10:$K$164,9,FALSE),0)","v":0},null,null,"700039753"]
["19353043","3","700180053",1935304,1935304,"Brooklyn Gardens Nursing & Rehabilitation Center",0,0,0,{"$f":"IFERROR(VLOOKUP(C14,[9]Summary!$C$10:$K$164,9,FALSE),0)","v":0},null,null,"700180053"]
["23242253","3","700130853",2324225,2324225,"Brooklyn United Methodist Church Home",0,0,0,{"$f":"IFERROR(VLOOKUP(C15,[9]Summary!$C$10:$K$164,9,FALSE),0)","v":0},null,null,"700130853"]
["29982093","3","515731853",1061178,2998209,"Brookside Multicare Nursing Center",0,5681,6471,{"$f":"IFERROR(VLOOKUP(C16,[9]Summary!$C$10:$K$164,9,FALSE),0)","v":6875},null,null,"515731853"]
["30075813","3","700136453",1283105,3007581,"Bushwick Center for Rehabilitation and Health Care",0,1961,590,{"$f":"IFERROR(VLOOKUP(C17,[9]Summary!$C$10:$K$164,9,FALSE),0)","v":2174},null,null,"700136453"]
["12831054","4","700136454",1283105,1283105,"Bushwick Center for Rehabilitation and Health Care",0,1339,1980,{"$f":"IFERROR(VLOOKUP(C18,[9]Summary!$C$10:$K$164,9,FALSE),0)","v":0},null,null,"700136454"]
["19805653","3","515330653",1980565,1980565,"Carillon Nursing and Rehabilitation Center",0,0,0,{"$f":"IFERROR(VLOOKUP(C19,[9]Summary!$C$10:$K$164,9,FALSE),0)","v":0},null,null,"515330653"]
["27008833","3","700337353",2700883,2700883,"Caring Family Nursing and Rehabilitation Center",0,0,0,{"$f":"IFERROR(VLOOKUP(C20,[9]Summary!$C$10:$K$164,9,FALSE),0)","v":0},null,null,"700337353"]
["13839443","3","700431053",1383944,1383944,"Carmel Richmond Healthcare and Rehabilitation Center",0,0,0,{"$f":"IFERROR(VLOOKUP(C21,[9]Summary!$C$10:$K$164,9,FALSE),0)","v":0},null,null,"700431053"]
["19921303","3","330132653",1992130,1992130,"Central Park Rehabilitation and Nursing Center",0,0,0,{"$f":"IFERROR(VLOOKUP(C22,[9]Summary!$C$10:$K$164,9,FALSE),0)","v":0},null,null,"330132653"]
["16523773","3","700335153",1652377,1652377,"Chapin Home For The Aging",0,0,0,{"$f":"IFERROR(VLOOKUP(C23,[9]Summary!$C$10:$K$164,9,FALSE),0)","v":0},null,null,"700335153"]
["6335503","3","322730453",633550,633550,"Charles T Sitrin Health Care Center Inc",2570,6415,7862,{"$f":"IFERROR(VLOOKUP(C24,[9]Summary!$C$10:$K$164,9,FALSE),0)","v":8224},null,null,"322730453"]
["15997243","3","700132353",1599724,1599724,"Cobble Hill Health Center Inc",0,0,0,{"$f":"IFERROR(VLOOKUP(C25,[9]Summary!$C$10:$K$164,9,FALSE),0)","v":0},null,null,"700132353"]
["29978223","3","295231053",1386992,2997822,"Cold Spring Hills Center for Nursing and Rehabilitation",3621,10183,12043,{"$f":"IFERROR(VLOOKUP(C26,[9]Summary!$C$10:$K$164,9,FALSE),0)","v":11975},null,null,"295231053"]
["23493063","3","700134853",2349306,2349306,"Concord Nursing and Rehabilitation Center",0,0,0,{"$f":"IFERROR(VLOOKUP(C27,[9]Summary!$C$10:$K$164,9,FALSE),0)","v":0},null,null,"700134853"]
["18119943","3","500130053",1811994,1811994,"Corning Center for Rehabilitation and Healthcare",0,0,0,{"$f":"IFERROR(VLOOKUP(C28,[9]Summary!$C$10:$K$164,9,FALSE),0)","v":0},null,null,"500130053"]
["14447513","3","110130663",1444751,1444751,"Cortland Regional Nursing and Rehabilitation Center",977,2497,3239,{"$f":"IFERROR(VLOOKUP(C29,[9]Summary!$C$10:$K$164,9,FALSE),0)","v":2862},null,null,"110130663"]
["29954443","3","262330053",1927999,2995444,"Crouse Community Center Inc",0,348,973,{"$f":"IFERROR(VLOOKUP(C30,[9]Summary!$C$10:$K$164,9,FALSE),0)","v":1479},null,null,"262330053"]
["29954444","4","262330054",1927999,2995444,"Crouse Community Center Inc",1283,1617,975,{"$f":"IFERROR(VLOOKUP(C31,[9]Summary!$C$10:$K$164,9,FALSE),0)","v":931},null,null,"262330054"]
["29954446","6","262330056",1927999,2995444,"Crouse Community Center Inc",1577,2579,2468,{"$f":"IFERROR(VLOOKUP(C32,[9]Summary!$C$10:$K$164,9,FALSE),0)","v":2745},null,null,"262330056"]
["29954447","7","262330057",1927999,2995444,"Crouse Community Center Inc",1948,0,0,{"$f":"IFERROR(VLOOKUP(C33,[9]Summary!$C$10:$K$164,9,FALSE),0)","v":0},null,null,"262330057"]
["11172663","3","010131253",1117266,1117266,"Daughters Of Sarah Nursing Center",0,0,0,{"$f":"IFERROR(VLOOKUP(C34,[9]Summary!$C$10:$K$164,9,FALSE),0)","v":0},null,null,"010131253"]
["10244463","3","700180953",1024446,1024446,"Downtown Brooklyn Nursing & Rehabilitation Center",0,0,0,{"$f":"IFERROR(VLOOKUP(C35,[9]Summary!$C$10:$K$164,9,FALSE),0)","v":0},null,null,"700180953"]
["10244465","5","700180955",1024446,1024446,"Downtown Brooklyn Nursing & Rehabilitation Center",0,0,0,{"$f":"IFERROR(VLOOKUP(C36,[9]Summary!$C$10:$K$164,9,FALSE),0)","v":0},null,null,"700180955"]
["10244466","6","700180956",1024446,1024446,"Downtown Brooklyn Nursing & Rehabilitation Center",0,0,0,{"$f":"IFERROR(VLOOKUP(C37,[9]Summary!$C$10:$K$164,9,FALSE),0)","v":0},null,null,"700180956"]
["19352993","3","700138053",1935299,1935299,"Dr Susan Smith Mckinney Nursing and Rehabilitation Center",0,277,1338,{"$f":"IFERROR(VLOOKUP(C38,[9]Summary!$C$10:$K$164,9,FALSE),0)","v":1640},null,null,"700138053"]
["19352994","4","700138054",1935299,1935299,"Dr Susan Smith Mckinney Nursing and Rehabilitation Center",0,0,0,{"$f":"IFERROR(VLOOKUP(C39,[9]Summary!$C$10:$K$164,9,FALSE),0)","v":0},null,null,"700138054"]
["18989843","3","700335953",1898984,1898984,"Dry Harbor Nursing Home",0,0,0,{"$f":"IFERROR(VLOOKUP(C40,[9]Summary!$C$10:$K$164,9,FALSE),0)","v":0},null,null,"700335953"]
{"$rows_left_out":120}