{"text_format":"1","workbook":"xlsx","n_sheets":19,"sheets":["Combine all facilities","Overview","A - Certification","A - CoverSheet","B - Year 1","B - Year 2","B - Year 3","B - Note Pad","B - Definitions","B - Budget Total","Combine all facilities (2)","C - Macros Instructions","C - Instructions","C - Timeline","D - Narrative","E -Instructions","E - Operating","E - Quality","E - Financial"],"not_rendered":{"charts":0,"images":12,"macros":1,"external_links":1,"defined_names":29,"comments":0,"pivot_tables":0},"unopened":[],"bounds":{"document_bytes":16777216,"sheet_cells":100000,"rows_first":2000,"rows_last":500,"rows_between":2000,"halvings":0,"cell_chars":16384,"cell_head_chars":4096},"cells_cut":0,"cells_raw":0,"read":"whole","date_system":"1900"}

{"sheet":"Combine all facilities","index":0,"n_rows":3,"n_cols":20,"rows_kept":3,"cut":false,"hidden":true,"merged":[[0,0,2,0],[0,1,0,12],[0,13,0,15],[0,16,1,18],[0,19,2,19],[1,1,1,3],[1,4,1,6],[1,7,1,9],[1,10,1,12],[1,13,1,15]]}
["Facility Name","Operating Expenses-Direct",null,null,null,null,null,null,null,null,null,null,null,"Operating Expenses-Indirect ",null,null,"Total Direct and Indirect Expenses",null,null,"Grand Total"]
[null,"Total Inpatient",null,null,"Total Outpatient",null,null,"Total Ancillary",null,null,"Total Direct",null,null,"Total Indirect"]
[null,"Year 1 Total Actual Expense","Year 2 Total Actual Expense","Year 3 Total Actual Expense","Year 1 Total Actual Expense","Year 2 Total Actual Expense","Year 3 Total Actual Expense","Year 1 Total Actual Expense","Year 2 Total Actual Expense","Year 3 Total Actual Expense","Year 1 Total Actual Expense","Year 2 Total Actual Expense","Year 3 Total Actual Expense","Year 1 Total Actual Expense","Year 2 Total Actual Expense","Year 3 Total Actual Expense","Year 1 Total Actual Expense","Year 2 Total Actual Expense","Year 3 Total Actual Expense"]

{"sheet":"Overview","index":1,"n_rows":23,"n_cols":3,"rows_kept":23,"cut":false,"hidden":false,"merged":[[18,1,18,2],[20,1,20,2],[16,1,16,2]]}
["Tab Name","Description","Notes"]
["A - Certification","PDF of signed & dated Certification","Instructions at top of page (MUST be updated with Quarterly Reports)"]
["A - CoverSheet","Summary of award information","This form will completed by the Department."]
["B - Year 1","Entry of budgeted Year 1 expenses","Instructions at top of page"]
["B - Year 2","Entry of budgeted Year 2 expenses","Instructions at top of page"]
["B - Year 3","Entry of budgeted Year 3 expenses","Instructions at top of page"]
["B - Note Pad","Additional details for Year 1-3 budgets\nAdditional details for Capital Financing\nAdditional details for Sustainability","Instructions at top of page"]
["B - Budget Total","Display of Total 3 Year Budget","No entry required; data is automatically populated from Year 1-3 Budgets"]
{"$rows_left_out":16}
{"sheet":"A - Certification","index":2,"n_rows":51,"n_cols":6,"rows_kept":51,"cut":false,"hidden":false,"merged":[[6,2,6,5],[1,2,1,5],[2,2,2,5],[3,2,3,5],[4,2,4,5],[5,2,5,5],[18,2,18,5],[7,2,7,5],[8,2,8,5],[9,2,9,5],[10,2,10,5],[11,2,11,5],[12,2,12,5],[13,2,13,5],[14,2,14,5],[15,2,15,5],[16,2,16,5],[17,2,17,5],[30,2,30,5],[19,2,19,5],[20,2,20,5],[21,2,21,5],[22,2,22,5],[23,2,23,5],[24,3,24,5],[25,2,25,5],[26,4,26,5],[28,2,28,5],[29,2,29,5],[44,2,44,3],[31,2,31,5],[33,2,33,5],[34,2,34,5],[35,2,35,5],[37,2,37,5],[38,2,38,5],[39,2,39,5],[40,2,40,5],[41,2,41,5],[42,2,42,5],[43,2,43,5],[56,2,56,5],[45,2,45,3],[46,2,46,5],[47,2,47,4],[48,2,48,4],[49,2,49,5],[50,2,50,4],[51,2,51,5],[52,2,52,5],[53,2,53,5],[54,2,54,5],[55,2,55,5]]}
[]
[null,null,"Instructions:  "]
[]
[null,null,"The facility's Operator Signatory (e.g., CEO or CFO) must sign and date the Certification Statement provided below as certification of:  The budgeted cost and statistical data detailed in the Expenditure Plan (Attachment B),  the Project Timeline (Attachment C) , VAP/Safety Net Quarterly Narrative Report (Attachment D), and the Metrics Quarterly Report (Attachment E) included as part of the Temporary Medicaid Rate Adjustment Agreement (TMRAA). "]
[null,null,"This Certification Statement must initially be provided in support of Attachment B, C, D and E submitted with the TMRAA.  This Certification Statement MUST ALSO BE SUBMITTED (with \"current\" signature and date) as certification of updated Project Timeline cost and statistical data being provided for a given quarter for each Quarterly Progress Report filing.    "]
[null,null,"1. Insert Signatory's Name and Title below."]
[]
[null,null,"2. Print the Certification Statement (print specs are pre-set) to obtain a hard copy of the pre-filled Certification Statement document.  "]
{"$rows_left_out":44}
{"sheet":"A - CoverSheet","index":3,"n_rows":27,"n_cols":5,"rows_kept":27,"cut":false,"hidden":false,"merged":[[23,2,23,3],[24,2,24,3],[25,2,25,3],[26,2,26,3],[21,2,21,3],[7,2,7,3],[8,1,11,1],[8,2,11,3],[12,2,13,3],[14,2,14,3],[20,2,20,3],[15,2,15,3],[16,2,16,3],[17,2,17,3],[18,2,18,3],[19,2,19,3]]}
[null,null,"This form will be completed by the Department"]
[]
[null,"NYS Department of Health"]
[null,"Vital Access Provider (VAP) / Safety Net Award Summary"]
[]
[null,"Date Submitted:              "]
[]
[null,"Legal Entity Name:",null,null,"opcert#"]
{"$rows_left_out":20}
{"sheet":"B - Year 1","index":4,"n_rows":123,"n_cols":13,"rows_kept":123,"cut":false,"hidden":false,"merged":[[9,0,9,12],[0,0,0,12],[1,0,1,12],[2,0,2,12],[4,0,5,12],[8,0,8,12],[6,0,6,12],[7,0,7,12],[86,0,86,12],[31,2,31,3],[31,6,31,8],[31,9,31,10],[32,0,32,12],[33,3,33,6],[33,7,33,11],[61,0,61,12],[62,0,62,12],[63,0,63,12],[64,3,64,6],[64,7,64,11],[121,7,121,10],[122,7,122,10],[87,0,87,12],[88,0,88,12],[89,3,89,6],[89,7,89,11],[119,7,119,10],[120,7,120,10],[10,0,10,12],[11,0,11,12],[12,0,12,12],[13,0,13,12],[14,0,14,12],[15,0,15,12],[16,0,16,1],[16,2,16,12],[17,0,17,1],[17,2,17,12],[18,0,18,1],[18,2,18,12],[19,0,19,1],[19,2,19,12],[21,0,21,12],[20,0,20,12],[22,0,22,12],[28,0,28,12],[29,0,29,12],[23,0,23,12],[24,0,24,12],[25,0,25,12],[26,0,26,12],[27,0,27,12]]}
["Vital Access Provider (VAP) / Safety Net Funding"]
["Medicaid Rate Adjustment"]
["Year 1 Expenditure Plan (VAP ONLY)"]
[]
[]
[]
["Instructions for Expenditure Plan :"]
[]
{"$rows_left_out":116}
{"sheet":"B - Year 2","index":5,"n_rows":121,"n_cols":13,"rows_kept":121,"cut":false,"hidden":false,"merged":[[13,0,13,12],[0,0,0,12],[1,0,1,12],[2,0,2,12],[4,0,5,12],[6,0,6,12],[7,0,7,12],[8,0,8,12],[9,0,9,12],[10,0,10,12],[11,0,11,12],[12,0,12,12],[14,0,14,12],[15,0,15,12],[16,0,16,1],[16,2,16,12],[17,0,17,1],[17,2,17,12],[27,0,27,12],[18,0,18,1],[18,2,18,12],[19,0,19,1],[19,2,19,12],[20,0,20,12],[21,0,21,12],[22,0,22,12],[23,0,23,12],[24,0,24,12],[25,0,25,12],[26,0,26,12],[84,0,84,12],[28,0,28,12],[29,2,29,3],[29,6,29,8],[29,9,29,10],[30,0,30,12],[31,3,31,6],[31,7,31,11],[59,0,59,12],[60,0,60,12],[61,0,61,12],[62,3,62,6],[62,7,62,11],[119,7,119,10],[120,7,120,10],[85,0,85,12],[86,0,86,12],[87,3,87,6],[87,7,87,11],[117,7,117,10],[118,7,118,10]]}
["Vital Access Provider (VAP) / Safety Net Funding"]
["Medicaid Rate Adjustment"]
["Year 2 Expenditure Plan (VAP ONLY)"]
[]
[]
[]
["Instructions for Expenditure Plan :"]
[]
{"$rows_left_out":114}
{"sheet":"B - Year 3","index":6,"n_rows":121,"n_cols":13,"rows_kept":121,"cut":false,"hidden":false,"merged":[[13,0,13,12],[0,0,0,12],[1,0,1,12],[2,0,2,12],[4,0,5,12],[6,0,6,12],[7,0,7,12],[8,0,8,12],[9,0,9,12],[10,0,10,12],[11,0,11,12],[12,0,12,12],[14,0,14,12],[15,0,15,12],[16,0,16,1],[16,2,16,12],[17,0,17,1],[17,2,17,12],[27,0,27,12],[18,0,18,1],[18,2,18,12],[19,0,19,1],[19,2,19,12],[20,0,20,12],[21,0,21,12],[22,0,22,12],[23,0,23,12],[24,0,24,12],[25,0,25,12],[26,0,26,12],[84,0,84,12],[28,0,28,12],[29,2,29,3],[29,6,29,8],[29,9,29,10],[30,0,30,12],[31,3,31,6],[31,7,31,11],[59,0,59,12],[60,0,60,12],[61,0,61,12],[62,3,62,6],[62,7,62,11],[119,7,119,10],[120,7,120,10],[85,0,85,12],[86,0,86,12],[87,3,87,6],[87,7,87,11],[117,7,117,10],[118,7,118,10]]}
["Vital Access Provider (VAP) / Safety Net Funding"]
["Medicaid Rate Adjustment"]
["Year 3 Expenditure Plan (VAP ONLY)"]
[]
[]
[]
["Instructions for Expenditure Plan :"]
[]
{"$rows_left_out":114}
{"sheet":"B - Note Pad","index":7,"n_rows":56,"n_cols":2,"rows_kept":56,"cut":false,"hidden":false,"merged":[[37,0,45,1],[36,0,36,1],[0,0,0,1],[2,0,2,1],[3,0,3,1],[6,0,6,1],[27,0,27,1],[14,0,14,1],[7,0,7,1],[77,0,77,1],[69,0,69,1],[70,0,70,1],[71,0,71,1],[72,0,72,1],[73,0,73,1],[74,0,74,1],[68,0,68,1],[55,0,55,1],[8,0,13,1],[75,0,75,1],[76,0,76,1],[15,0,26,1],[28,0,35,1],[67,0,67,1],[64,0,64,1],[62,0,62,1],[63,0,63,1],[65,0,65,1],[66,0,66,1],[47,0,54,1],[56,0,61,1],[46,0,46,1]]}
["Instructions:\nUnder \"Additional Details for Sustainability\", please provide a short description of how your plan will become sustainable after VAP funding has ended (required). \n\nUnder \"Additional Details for Capital Financing\", please provide a short description of how capital funds will be financed (if your project is related to outside capital funds).\n\nUnder \"Additional Details for Year _ Budget\", please provide additional information and/or details to specific cost items included in your budget (if needed).  Specify by applicable budget year for the given cost item being detailed.  Add lines as needed."]
[]
["Note Pad Section"]
[]
["Date Submitted:",{"$f":"IF('B - Year 1'!C32=\"\",\"\",('B - Year 1'!C32))","v":""}]
["First Quarter:",{"$f":"IF('B - Year 1'!J32=\"\",\"\",('B - Year 1'!J32))","v":""}]
[]
["General Notes & Other Comments:"]
{"$rows_left_out":49}
{"sheet":"B - Definitions","index":8,"n_rows":70,"n_cols":3,"rows_kept":70,"cut":false,"hidden":false,"merged":[[0,0,0,2],[1,0,1,2]]}
["Vital Access Provider (VAP) Funding"]
["Expenditure Plan Definitions"]
["Line No","Description","Definition"]
[null,"Operating","VAP funding can only be applied to operating costs.  \n\nOperating costs include both overhead costs and administrative costs. This includes, but is not limited to: utilities, wages, advertising, raw materials, office supplies and consumables.  "]
[null,"Capital","Capital costs should not be included in the expenditure plans or timelines. \n\nCapital costs are fixed, one-time expenses incurred on the purchase of land, buildings, construction, rent and capital debt.\nIf your project is dependent on outside capital funding, please include these details on \"B - Note Pad\". "]
["Operating Expenses-Direct"]
["A.","Inpatient Services:"]
[1,"Physicians","A doctor of medicine or of osteopathy who is fully licensed to practice medicine."]
{"$rows_left_out":63}
{"sheet":"B - Budget Total","index":9,"n_rows":122,"n_cols":12,"rows_kept":122,"cut":false,"hidden":false,"merged":[[6,0,6,11],[0,0,0,11],[1,0,1,11],[2,0,2,11],[4,0,4,11],[5,0,5,11],[17,0,17,1],[17,2,17,11],[7,0,7,11],[8,0,8,11],[9,0,9,11],[10,0,10,11],[11,0,11,11],[12,0,12,12],[13,0,13,11],[14,0,14,11],[15,0,15,11],[16,0,16,1],[16,2,16,11],[27,0,27,11],[18,0,18,1],[18,2,18,11],[19,0,19,1],[19,2,19,11],[20,0,20,11],[21,0,21,12],[22,0,22,11],[23,0,23,11],[24,0,24,11],[25,0,25,11],[26,0,26,11],[28,0,28,11],[29,2,29,3],[29,6,29,8],[29,9,29,10],[30,0,30,11],[31,11,33,11],[60,0,60,11],[61,0,61,11],[62,0,62,11],[63,3,63,6],[63,7,63,10],[31,0,33,0],[31,1,33,1],[31,2,33,2],[31,3,32,6],[31,7,32,10],[119,7,119,9],[120,7,120,9],[121,7,121,9],[85,0,85,11],[86,0,86,11],[87,0,87,11],[88,3,88,6],[88,7,88,10],[118,7,118,9]]}
["Vital Access Provider (VAP) / Safety Net Funding"]
["Medicaid Rate Adjustment"]
["3 Year Total Operating Budget"]
[]
[]
[]
["Instructions for Expenditure Plan :"]
["DO NOT KEY TO THIS SCHEDULE! It will AUTO FILL/CALC based on data keyed to Years 1-3 Expend Worksheets."]
{"$rows_left_out":115}
{"sheet":"Combine all facilities (2)","index":10,"n_rows":3,"n_cols":20,"rows_kept":3,"cut":false,"hidden":true,"merged":[[0,0,2,0],[0,1,0,12],[0,13,0,15],[0,16,1,18],[0,19,2,19],[1,1,1,3],[1,4,1,6],[1,7,1,9],[1,10,1,12],[1,13,1,15]]}
["Facility Name","Operating Expenses-Direct",null,null,null,null,null,null,null,null,null,null,null,"Operating Expenses-Indirect ",null,null,"Total Direct and Indirect Expenses",null,null,"Grand Total"]
[null,"Total Inpatient",null,null,"Total Outpatient",null,null,"Total Ancillary",null,null,"Total Direct",null,null,"Total Indirect"]
[null,"Year 1 Total Actual Expense","Year 2 Total Actual Expense","Year 3 Total Actual Expense","Year 1 Total Actual Expense","Year 2 Total Actual Expense","Year 3 Total Actual Expense","Year 1 Total Actual Expense","Year 2 Total Actual Expense","Year 3 Total Actual Expense","Year 1 Total Actual Expense","Year 2 Total Actual Expense","Year 3 Total Actual Expense","Year 1 Total Actual Expense","Year 2 Total Actual Expense","Year 3 Total Actual Expense","Year 1 Total Actual Expense","Year 2 Total Actual Expense","Year 3 Total Actual Expense"]

{"sheet":"C - Macros Instructions","index":11,"n_rows":33,"n_cols":2,"rows_kept":33,"cut":false,"hidden":false,"merged":[[32,1,32,8],[1,1,1,8],[28,1,28,8],[29,1,29,8],[30,1,30,8],[31,1,31,8]]}
[]
[null,"IMPORTANT NOTICE"]
[]
[]
[]
[]
[]
[]
{"$rows_left_out":26}
{"sheet":"C - Instructions","index":12,"n_rows":53,"n_cols":2,"rows_kept":53,"cut":false,"hidden":false,"merged":[[53,1,53,14],[41,1,41,14],[42,1,42,14],[43,1,43,14],[44,1,44,14],[45,1,45,14],[46,1,46,14],[47,1,47,14],[48,1,48,14],[50,1,50,14],[51,1,51,14],[52,1,52,14],[49,1,49,14],[40,1,40,14],[0,1,0,14],[1,1,1,14],[2,1,2,14],[4,1,4,14],[35,1,35,14],[36,1,36,14],[37,1,37,14],[38,1,38,14],[39,1,39,14],[3,1,3,14]]}
[null,"Vital Access Provider (VAP) Funding"]
[null,"Medicaid Rate Adjustment"]
[null,"Project Timeline"]
[]
[null,"The following instructions should be utilized when completing the Project Timeline tab of the VAP report"]
[]
[]
[]
{"$rows_left_out":46}
{"sheet":"C - Timeline","index":13,"n_rows":24,"n_cols":45,"rows_kept":24,"cut":false,"hidden":false,"merged":[[14,1,14,2],[14,16,14,17],[14,31,14,32],[23,0,24,3],[17,1,17,2],[17,16,17,17],[17,31,17,32],[18,1,18,2],[18,16,18,17],[18,31,18,32],[23,15,24,18],[23,30,24,33],[21,0,21,3],[21,30,21,33],[21,15,21,18],[12,16,12,17],[12,31,12,32],[13,1,13,2],[13,16,13,17],[13,31,13,32],[0,0,2,14],[0,15,2,29],[0,30,2,44],[19,1,19,2],[19,16,19,17],[19,31,19,32],[15,1,15,2],[15,16,15,17],[15,31,15,32],[16,1,16,2],[16,16,16,17],[16,31,16,32],[11,1,11,2],[11,16,11,17],[11,31,11,32],[12,1,12,2],[3,0,3,14],[3,15,3,29],[3,30,3,44],[10,31,10,32],[7,1,7,14],[7,16,7,29],[7,31,7,44],[9,30,9,32],[10,1,10,2],[10,16,10,17],[9,0,9,2],[9,15,9,17],[6,31,6,42],[6,16,6,27],[6,1,6,12],[4,0,4,2],[4,15,4,17],[4,13,5,13],[4,14,5,14],[4,3,5,12],[4,18,5,27],[4,43,5,43],[4,44,5,44],[4,33,5,42],[4,28,5,28],[4,29,5,29],[4,30,4,32]]}
["Vital Access Provider (VAP) Funding\nMedicaid Rate Adjustment\nProject Timeline Year 1",null,null,null,null,null,null,null,null,null,null,null,null,null,null,"Vital Access Provider (VAP) Funding\nMedicaid Rate Adjustment\nProject Timeline Year 2",null,null,null,null,null,null,null,null,null,null,null,null,null,null,"Vital Access Provider (VAP) Funding\nMedicaid Rate Adjustment\nProject Timeline Year 3"]
[]
[]
["           See Instructions                                                                                                                                                                                   See Instructions",null,null,null,null,null,null,null,null,null,null,null,null,null,null,"           See Instructions                                                                                                                                                                                   See Instructions",null,null,null,null,null,null,null,null,null,null,null,null,null,null,"           See Instructions                                                                                                                                                                                   See Instructions"]
["Action/Activity Item",null,null,null,null,null,null,null,null,null,null,null,null,"Submission Date",{"$f":"IF('B - Year 1'!C32=\"\",\"\",(EDATE('B - Year 1'!C32,0)))","v":""},"Action/Activity Item",null,null,null,null,null,null,null,null,null,null,null,null,"Submission Date",{"$f":"O5","v":""},"Action/Activity Item",null,null,null,null,null,null,null,null,null,null,null,null,"Submission Date",{"$f":"O5","v":""}]
[1,"of",null,null,null,null,null,null,null,null,null,null,null,null,null,1,"of",null,null,null,null,null,null,null,null,null,null,null,null,null,1,"of"]
["Overall Goal / Objective",null,null,null,null,null,null,null,null,null,null,null,null,"Begin Date of First Quarter",{"$f":"IF('B - Year 1'!J32=\"\",\"\",(EDATE('B - Year 1'!J32,0)))","v":""},"Overall Goal / Objective",null,null,null,null,null,null,null,null,null,null,null,null,"Begin Date of First Quarter",{"$f":"IF(O7=\"\",\"\",EDATE(O7,12))","v":""},"Overall Goal / Objective",null,null,null,null,null,null,null,null,null,null,null,null,"Begin Date of First Quarter",{"$f":"IF(O7=\"\",\"\",EDATE(O7,24))","v":""}]
["Outcome",null,null,null,null,null,null,null,null,null,null,null,null,null,null,"Outcome",null,null,null,null,null,null,null,null,null,null,null,null,null,null,"Outcome"]
{"$rows_left_out":17}
{"sheet":"D - Narrative","index":14,"n_rows":8,"n_cols":2,"rows_kept":8,"cut":false,"hidden":false,"merged":[[8,0,8,1],[0,0,0,1],[2,0,2,1],[5,0,5,1],[6,0,6,1],[7,0,7,1]]}
["OUTLINE FOR VAP/SAFETY NET QUARTERLY PROGRESS REPORT\n~ RESTRUCTURING PROGRAM WORK PLAN ~\n\nThis Attachment is to provide to the Department a narrative of the facility’s Work Plan in the table below.\n1.  SUMMARY STATEMENT\nThis section should include a narrative describing the progress made on the Project being funded by the Agreement.  This overview should be concise and to the point.  Further details can be included in the section which addresses specific deliverables.\n2.  PROGRAM GOALS\nThis section should include details on the current status toward reaching the goals and objectives expected to be accomplished under the terms of the Agreement.  Project goals should be quantified as much as possible.  The Report on the Restructuring Program Work Plan (Work Plan) must include:\na. specific actions taken during the quarter for achieving long term financial stability, including the current status of Department approved benchmarks used to measure performance in achieving the goals;\nb. address how the project is ensuring that the healthcare needs of the community are being met, including any actionable plan developed in collaboration with community and/or regional stakeholders;\nc. a detailed analysis of performance measurements, as agreed to by the Facility and approved by the Department per the Work Plan, targeting improvement in the quality of care provided;\nd. address disparities in health services and how the project will help to provide better care to vulnerable populations who are at greater risk for experiencing poorer health outcomes than the general population."]
["Facility:"]
["VAP/Safety Net Quarterly Narrative Report - Attachment D"]
["First Quarter:",{"$f":"IF('B - Year 1'!J32=\"\",\"\",EDATE('B - Year 1'!J32,0))","v":""}]
["Submission Date:",{"$f":"IF('B - Year 1'!C32=\"\",\"\",(EDATE('B - Year 1'!C32,0)))","v":""}]
["Summary Statement:"]
[]
["Program Goals:"]
{"$rows_left_out":1}
{"sheet":"E -Instructions","index":15,"n_rows":47,"n_cols":3,"rows_kept":47,"cut":false,"hidden":false,"merged":[]}
[]
[]
[]
[]
[]
[]
[]
[]
{"$rows_left_out":40}
{"sheet":"E - Operating","index":16,"n_rows":12,"n_cols":31,"rows_kept":12,"cut":false,"hidden":false,"merged":[[7,0,7,2],[8,0,8,2],[9,0,9,2],[10,0,10,2],[11,0,11,2],[5,29,5,30],[5,13,5,14],[5,15,5,16],[5,17,5,18],[5,19,5,20],[5,21,5,22],[5,23,5,24],[5,9,5,10],[5,11,5,12],[4,7,4,14],[5,25,5,26],[5,27,5,28],[5,0,6,2],[5,3,6,3],[5,4,6,4],[5,6,6,6],[5,7,5,8],[5,5,6,5],[0,0,0,3],[3,0,3,2],[3,3,4,6],[4,15,4,22],[4,23,4,30]]}
["Operating Metrics"]
[]
[]
["Objective",null,null,null,null,null,null,"Start Date",null,{"$f":"IF('B - Year 1'!J32=\"\",\"\",(EDATE('B - Year 1'!J32,0)))","v":""},null,null,null,null,null,"Start Date",null,{"$f":"IF(J4=\"\",\"\",EDATE(J4,12))","v":""},null,null,null,null,null,"Start Date",null,{"$f":"IF(J4=\"\",\"\",EDATE(J4,24))","v":""}]
[null,"of",null,null,null,null,null,"Year 1",null,null,null,null,null,null,null,"Year 2",null,null,null,null,null,null,null,"Year 3"]
["#",null,null,"Metric","Description","Unit of Measure","Baseline","Quarter 1",null,"Quarter 2",null,"Quarter 3",null,"Quarter 4",null,"Quarter 1",null,"Quarter 2",null,"Quarter 3",null,"Quarter 4",null,"Quarter 1",null,"Quarter 2",null,"Quarter 3",null,"Quarter 4"]
[null,null,null,null,null,null,null,"Projected","Result","Projected","Result","Projected","Result","Projected","Result","Projected","Result","Projected","Result","Projected","Result","Projected","Result","Projected","Result","Projected","Result","Projected","Result","Projected","Result"]
[1]
{"$rows_left_out":5}
{"sheet":"E - Quality","index":17,"n_rows":12,"n_cols":31,"rows_kept":12,"cut":false,"hidden":false,"merged":[[7,0,7,2],[8,0,8,2],[9,0,9,2],[10,0,10,2],[11,0,11,2],[5,29,5,30],[5,13,5,14],[5,15,5,16],[5,17,5,18],[5,19,5,20],[5,21,5,22],[5,23,5,24],[5,9,5,10],[5,11,5,12],[4,7,4,14],[5,25,5,26],[5,27,5,28],[5,0,6,2],[5,3,6,3],[5,4,6,4],[5,6,6,6],[5,7,5,8],[5,5,6,5],[0,0,0,3],[3,0,3,2],[3,3,4,6],[4,15,4,22],[4,23,4,30]]}
["Quality Metrics"]
[]
[]
["Objective",null,null,null,null,null,null,"Start Date",null,{"$f":"IF('B - Year 1'!J32=\"\",\"\",(EDATE('B - Year 1'!J32,0)))","v":""},null,null,null,null,null,"Start Date",null,{"$f":"IF(J4=\"\",\"\",EDATE(J4,12))","v":""},null,null,null,null,null,"Start Date",null,{"$f":"IF(J4=\"\",\"\",EDATE(J4,24))","v":""}]
[null,"of",null,null,null,null,null,"Year 1",null,null,null,null,null,null,null,"Year 2 ",null,null,null,null,null,null,null,"Year 3"]
["#",null,null,"Metric","Description","Unit of Measure","Baseline","Quarter 1",null,"Quarter 2",null,"Quarter 3",null,"Quarter 4",null,"Quarter 1",null,"Quarter 2",null,"Quarter 3",null,"Quarter 4",null,"Quarter 1",null,"Quarter 2",null,"Quarter 3",null,"Quarter 4"]
[null,null,null,null,null,null,null,"Projected","Result","Projected","Result","Projected","Result","Projected","Result","Projected","Result","Projected","Result","Projected","Result","Projected","Result","Projected","Result","Projected","Result","Projected","Result","Projected","Result"]
[1]
{"$rows_left_out":5}
{"sheet":"E - Financial","index":18,"n_rows":14,"n_cols":31,"rows_kept":14,"cut":false,"hidden":false,"merged":[[7,0,7,2],[8,0,8,2],[9,0,9,2],[10,0,10,2],[11,0,11,2],[5,29,5,30],[5,13,5,14],[5,15,5,16],[5,17,5,18],[5,19,5,20],[5,21,5,22],[5,23,5,24],[5,9,5,10],[5,11,5,12],[4,7,4,14],[5,25,5,26],[5,27,5,28],[5,0,6,2],[5,3,6,3],[5,4,6,4],[5,6,6,6],[5,7,5,8],[5,5,6,5],[0,0,0,3],[3,0,3,2],[3,3,4,6],[4,15,4,22],[4,23,4,30]]}
["Financial Metrics"]
[]
[]
["Objective",null,null,null,null,null,null,"Start Date",null,{"$f":"IF('B - Year 1'!J32=\"\",\"\",(EDATE('B - Year 1'!J32,0)))","v":""},null,null,null,null,null,"Start Date",null,{"$f":"IF(J4=\"\",\"\",EDATE(J4,12))","v":""},null,null,null,null,null,"Start Date",null,{"$f":"IF(J4=\"\",\"\",EDATE(J4,24))","v":""}]
[null,"of",null,null,null,null,null,"Year 1",null,null,null,null,null,null,null,"Year 2",null,null,null,null,null,null,null,"Year 3"]
["#",null,null,"Metric","Description","Unit of Measure","Baseline","Quarter 1",null,"Quarter 2",null,"Quarter 3",null,"Quarter 4",null,"Quarter 1",null,"Quarter 2",null,"Quarter 3",null,"Quarter 4",null,"Quarter 1",null,"Quarter 2",null,"Quarter 3",null,"Quarter 4"]
[null,null,null,null,null,null,null,"Projected","Result","Projected","Result","Projected","Result","Projected","Result","Projected","Result","Projected","Result","Projected","Result","Projected","Result","Projected","Result","Projected","Result","Projected","Result","Projected","Result"]
[1]
{"$rows_left_out":6}