{"text_format":"1","workbook":"xlsx","n_sheets":8,"sheets":["Cover","BS Assets","BS Liab","Income Statement","Statistics Summary","Definitions","Explanation Sheet","Reconciliation"],"not_rendered":{"charts":0,"images":12,"macros":1,"external_links":0,"defined_names":6,"comments":0,"pivot_tables":0},"unopened":[],"bounds":{"document_bytes":16777216,"sheet_cells":100000,"rows_first":2000,"rows_last":500,"rows_between":2000,"halvings":0,"cell_chars":16384,"cell_head_chars":4096},"cells_cut":0,"cells_raw":0,"read":"whole","date_system":"1900"}

{"sheet":"Cover","index":0,"n_rows":49,"n_cols":23,"rows_kept":49,"cut":false,"hidden":false,"merged":[[4,6,4,22],[5,6,5,22],[6,6,6,22],[7,6,7,13],[7,14,7,18],[7,19,7,20],[7,21,7,22],[11,6,11,22],[12,6,12,22],[13,6,13,22],[14,6,14,22],[8,6,8,13],[8,14,8,18],[8,19,8,20],[8,21,8,22],[33,2,33,22],[17,6,17,22],[18,6,18,22],[19,6,19,22],[20,6,20,22]]}
[{"$f":"COLUMN()","v":1},{"$f":"COLUMN()","v":2},{"$f":"COLUMN()","v":3},{"$f":"COLUMN()","v":4},{"$f":"COLUMN()","v":5},{"$f":"COLUMN()","v":6},{"$f":"COLUMN()","v":7},{"$f":"COLUMN()","v":8},{"$f":"COLUMN()","v":9},{"$f":"COLUMN()","v":10},{"$f":"COLUMN()","v":11},{"$f":"COLUMN()","v":12},{"$f":"COLUMN()","v":13},{"$f":"COLUMN()","v":14},{"$f":"COLUMN()","v":15},{"$f":"COLUMN()","v":16},{"$f":"COLUMN()","v":17},{"$f":"COLUMN()","v":18},{"$f":"COLUMN()","v":19},{"$f":"COLUMN()","v":20},{"$f":"COLUMN()","v":21},{"$f":"COLUMN()","v":22},{"$f":"COLUMN()","v":23}]
[" ","IAAF Report"]
[]
[null,"I. Facility Information"]
[null,null,null,null,null,"Organization Name "]
[null,null,null,null,null,"Medicaid Participant # "]
[null,null,null,null,null,"Operating Certificate # "]
[null,null,null,null,null,null,"Address",null,null,null,null,null,null,null,"City",null,null,null,null,"State",null,"Zip"]
[null,null,null,null,null,"Address ",null,null,null,null,null,null,null,null,null,null,null,null,null,"NY"]
[]
{"$rows_left_out":40}
{"sheet":"BS Assets","index":1,"n_rows":30,"n_cols":40,"rows_kept":30,"cut":false,"hidden":false,"merged":[]}
["←","Statement of Financial Position (ASSETS)",null,{"$f":"COLUMN()","v":4},{"$f":"COLUMN()","v":5},{"$f":"COLUMN()","v":6},{"$f":"COLUMN()","v":7},{"$f":"COLUMN()","v":8},{"$f":"COLUMN()","v":9},{"$f":"COLUMN()","v":10},{"$f":"COLUMN()","v":11},{"$f":"COLUMN()","v":12},{"$f":"COLUMN()","v":13},{"$f":"COLUMN()","v":14},{"$f":"COLUMN()","v":15},{"$f":"COLUMN()","v":16},{"$f":"COLUMN()","v":17},{"$f":"COLUMN()","v":18},{"$f":"COLUMN()","v":19},{"$f":"COLUMN()","v":20},{"$f":"COLUMN()","v":21},{"$f":"COLUMN()","v":22},{"$f":"COLUMN()","v":23},{"$f":"COLUMN()","v":24},{"$f":"COLUMN()","v":25},{"$f":"COLUMN()","v":26},{"$f":"COLUMN()","v":27},{"$f":"COLUMN()","v":28},{"$f":"COLUMN()","v":29},{"$f":"COLUMN()","v":30},{"$f":"COLUMN()","v":31},{"$f":"COLUMN()","v":32},{"$f":"COLUMN()","v":33},{"$f":"COLUMN()","v":34},{"$f":"COLUMN()","v":35},{"$f":"COLUMN()","v":36},{"$f":"COLUMN()","v":37},{"$f":"COLUMN()","v":38},{"$f":"COLUMN()","v":39},{"$f":"COLUMN()","v":40}]
[{"$f":"IF(Cover!$G$5=\"\",\"\",Cover!$G$5)","v":""},null,null,null,null,"2014-01-31","2014-02-28","2014-03-31","2014-04-30","2014-05-31","2014-06-30","2014-06-30",{"$f":"+L2","v":"2014-06-30"},"2014-07-31","2014-07-31",{"$f":"+O2","v":"2014-07-31"},"2014-08-31","2014-08-31",{"$f":"+R2","v":"2014-08-31"},"2014-09-30","2014-09-30",{"$f":"+U2","v":"2014-09-30"},"2014-10-31","2014-10-31",{"$f":"+X2","v":"2014-10-31"},"2014-11-30","2014-11-30",{"$f":"+AA2","v":"2014-11-30"},"2014-12-31","2014-12-31",{"$f":"+AD2","v":"2014-12-31"},"2015-01-31","2015-01-31",{"$f":"+AG2","v":"2015-01-31"},"2015-02-28","2015-02-28",{"$f":"+AJ2","v":"2015-02-28"},"2015-03-31","2015-03-31",{"$f":"+AM2","v":"2015-03-31"}]
["ASSETS",null,null,"Definition Help",null,"Actual","Actual","Actual","Actual","Actual","Projected","Actual","Difference","Projected","Actual","Difference","Projected","Actual","Difference","Projected","Actual","Difference","Projected","Actual","Difference","Projected","Actual","Difference","Projected","Actual","Difference","Projected","Actual","Difference","Projected","Actual","Difference","Projected","Actual","Difference"]
["Current Assets"]
[null,"Cash and cash equivalents",null,null,null,null,null,null,null,null,null,null,{"$f":"+L5-K5","v":0},null,null,{"$f":"+O5-N5","v":0},null,null,{"$f":"+R5-Q5","v":0},null,null,{"$f":"+U5-T5","v":0},null,null,{"$f":"+X5-W5","v":0},null,null,{"$f":"+AA5-Z5","v":0},null,null,{"$f":"+AD5-AC5","v":0},null,null,{"$f":"+AG5-AF5","v":0},null,null,{"$f":"+AJ5-AI5","v":0},null,null,{"$f":"+AM5-AL5","v":0}]
[null,"Malpractice/Savings Fund",null,null,null,null,null,null,null,null,null,null,{"$f":"+L6-K6","v":0},null,null,{"$f":"+O6-N6","v":0},null,null,0,null,null,{"$f":"+U6-T6","v":0},null,null,{"$f":"+X6-W6","v":0},null,null,{"$f":"+AA6-Z6","v":0},null,null,{"$f":"+AD6-AC6","v":0},null,null,{"$f":"+AG6-AF6","v":0},null,null,{"$f":"+AJ6-AI6","v":0},null,null,{"$f":"+AM6-AL6","v":0}]
[null,"Accounts receivable",null,null,null,null,null,null,null,null,null,null,{"$f":"+L7-K7","v":0},null,null,{"$f":"+O7-N7","v":0},null,null,0,null,null,{"$f":"+U7-T7","v":0},null,null,{"$f":"+X7-W7","v":0},null,null,{"$f":"+AA7-Z7","v":0},null,null,{"$f":"+AD7-AC7","v":0},null,null,{"$f":"+AG7-AF7","v":0},null,null,{"$f":"+AJ7-AI7","v":0},null,null,{"$f":"+AM7-AL7","v":0}]
[null,"Less Allowances (Negative)",null,null,null,null,null,null,null,null,null,null,{"$f":"+L8-K8","v":0},null,null,{"$f":"+O8-N8","v":0},null,null,0,null,null,{"$f":"+U8-T8","v":0},null,null,{"$f":"+X8-W8","v":0},null,null,{"$f":"+AA8-Z8","v":0},null,null,{"$f":"+AD8-AC8","v":0},null,null,{"$f":"+AG8-AF8","v":0},null,null,{"$f":"+AJ8-AI8","v":0},null,null,{"$f":"+AM8-AL8","v":0}]
[null,"Net accounts receivable",null,null,null,{"$f":"+F7+F8","v":0},0,0,0,0,0,0,0,0,0,0,0,0,0,0,0,0,0,0,0,0,0,0,0,0,0,0,0,0,0,0,0,0,0,0]
[null,"Grants & other receivable",null,null,null,null,null,null,null,null,null,null,{"$f":"+L10-K10","v":0},null,null,{"$f":"+O10-N10","v":0},null,null,0,null,null,{"$f":"+U10-T10","v":0},null,null,{"$f":"+X10-W10","v":0},null,null,{"$f":"+AA10-Z10","v":0},null,null,{"$f":"+AD10-AC10","v":0},null,null,{"$f":"+AG10-AF10","v":0},null,null,{"$f":"+AJ10-AI10","v":0},null,null,{"$f":"+AM10-AL10","v":0}]
{"$rows_left_out":21}
{"sheet":"BS Liab","index":2,"n_rows":29,"n_cols":40,"rows_kept":29,"cut":false,"hidden":false,"merged":[]}
["←","Statement of Financial Position (LIABILITIES AND EQUITY)",null,{"$f":"COLUMN()","v":4},{"$f":"COLUMN()","v":5},{"$f":"COLUMN()","v":6},{"$f":"COLUMN()","v":7},{"$f":"COLUMN()","v":8},{"$f":"COLUMN()","v":9},{"$f":"COLUMN()","v":10},{"$f":"COLUMN()","v":11},{"$f":"COLUMN()","v":12},{"$f":"COLUMN()","v":13},{"$f":"COLUMN()","v":14},{"$f":"COLUMN()","v":15},{"$f":"COLUMN()","v":16},{"$f":"COLUMN()","v":17},{"$f":"COLUMN()","v":18},{"$f":"COLUMN()","v":19},{"$f":"COLUMN()","v":20},{"$f":"COLUMN()","v":21},{"$f":"COLUMN()","v":22},{"$f":"COLUMN()","v":23},{"$f":"COLUMN()","v":24},{"$f":"COLUMN()","v":25},{"$f":"COLUMN()","v":26},{"$f":"COLUMN()","v":27},{"$f":"COLUMN()","v":28},{"$f":"COLUMN()","v":29},{"$f":"COLUMN()","v":30},{"$f":"COLUMN()","v":31},{"$f":"COLUMN()","v":32},{"$f":"COLUMN()","v":33},{"$f":"COLUMN()","v":34},{"$f":"COLUMN()","v":35},{"$f":"COLUMN()","v":36},{"$f":"COLUMN()","v":37},{"$f":"COLUMN()","v":38},{"$f":"COLUMN()","v":39},{"$f":"COLUMN()","v":40}]
[{"$f":"IF(Cover!$G$5=\"\",\"\",Cover!$G$5)","v":""},null,null,null,null,"2014-01-31","2014-02-28","2014-03-31","2014-04-30","2014-05-31","2014-06-30","2014-06-30",{"$f":"+L2","v":"2014-06-30"},"2014-07-31","2014-07-31",{"$f":"+O2","v":"2014-07-31"},"2014-08-31","2014-08-31",{"$f":"+R2","v":"2014-08-31"},"2014-09-30","2014-09-30",{"$f":"+U2","v":"2014-09-30"},"2014-10-31","2014-10-31",{"$f":"+X2","v":"2014-10-31"},"2014-11-30","2014-11-30",{"$f":"+AA2","v":"2014-11-30"},"2014-12-31","2014-12-31",{"$f":"+AD2","v":"2014-12-31"},"2015-01-31","2015-01-31",{"$f":"+AG2","v":"2015-01-31"},"2015-02-28","2015-02-28",{"$f":"+AJ2","v":"2015-02-28"},"2015-03-31","2015-03-31",{"$f":"+AM2","v":"2015-03-31"}]
["LIABILITIES AND EQUITIES",null,null,"Definition Help",null,"Actual","Actual","Actual","Actual","Actual","Projected","Actual","Difference","Projected","Actual","Difference","Projected","Actual","Difference","Projected","Actual","Difference","Projected","Actual","Difference","Projected","Actual","Difference","Projected","Actual","Difference","Projected","Actual","Difference","Projected","Actual","Difference","Projected","Actual","Difference"]
["Current Liabilities"]
[null,"Account Payable",null,null,null,null,null,null,null,null,null,null,{"$f":"+L5-K5","v":0},null,null,{"$f":"+O5-N5","v":0},null,null,{"$f":"+R5-Q5","v":0},null,null,{"$f":"+U5-T5","v":0},null,null,{"$f":"+X5-W5","v":0},null,null,{"$f":"+AA5-Z5","v":0},null,null,{"$f":"+AD5-AC5","v":0},null,null,{"$f":"+AG5-AF5","v":0},null,null,{"$f":"+AJ5-AI5","v":0},null,null,{"$f":"+AM5-AL5","v":0}]
[null,"Other accrued expenses",null,null,null,null,null,null,null,null,null,null,{"$f":"+L6-K6","v":0},null,null,{"$f":"+O6-N6","v":0},null,null,{"$f":"+R6-Q6","v":0},null,null,{"$f":"+U6-T6","v":0},null,null,{"$f":"+X6-W6","v":0},null,null,{"$f":"+AA6-Z6","v":0},null,null,{"$f":"+AD6-AC6","v":0},null,null,{"$f":"+AG6-AF6","v":0},null,null,{"$f":"+AJ6-AI6","v":0},null,null,{"$f":"+AM6-AL6","v":0}]
[null,"Accrued salaries and related withholdings",null,null,null,null,null,null,null,null,null,null,0,null,null,0,null,null,0,null,null,0,null,null,0,null,null,0,null,null,0,null,null,0,null,null,0,null,null,0]
[null,"Accrued pension payable",null,null,null,null,null,null,null,null,null,null,0,null,null,0,null,null,0,null,null,0,null,null,0,null,null,0,null,null,0,null,null,0,null,null,0,null,null,0]
[null,"Accrued interest payable",null,null,null,null,null,null,null,null,null,null,0,null,null,0,null,null,0,null,null,0,null,null,0,null,null,0,null,null,0,null,null,0,null,null,0,null,null,0]
[null,"Current portion of long term debt",null,null,null,null,null,null,null,null,null,null,0,null,null,0,null,null,0,null,null,0,null,null,0,null,null,0,null,null,0,null,null,0,null,null,0,null,null,0]
{"$rows_left_out":20}
{"sheet":"Income Statement","index":3,"n_rows":37,"n_cols":50,"rows_kept":37,"cut":false,"hidden":false,"merged":[[29,1,29,2]]}
[null,"Statement of Operations (P&L) ( Cash Basis)",null,{"$f":"COLUMN()","v":4},{"$f":"COLUMN()","v":5},{"$f":"COLUMN()","v":6},{"$f":"COLUMN()","v":7},{"$f":"COLUMN()","v":8},{"$f":"COLUMN()","v":9},{"$f":"COLUMN()","v":10},{"$f":"COLUMN()","v":11},{"$f":"COLUMN()","v":12},{"$f":"COLUMN()","v":13},{"$f":"COLUMN()","v":14},{"$f":"COLUMN()","v":15},{"$f":"COLUMN()","v":16},{"$f":"COLUMN()","v":17},{"$f":"COLUMN()","v":18},{"$f":"COLUMN()","v":19},{"$f":"COLUMN()","v":20},{"$f":"COLUMN()","v":21},{"$f":"COLUMN()","v":22},{"$f":"COLUMN()","v":23},{"$f":"COLUMN()","v":24},{"$f":"COLUMN()","v":25},{"$f":"COLUMN()","v":26},{"$f":"COLUMN()","v":27},{"$f":"COLUMN()","v":28},{"$f":"COLUMN()","v":29},{"$f":"COLUMN()","v":30},{"$f":"COLUMN()","v":31},{"$f":"COLUMN()","v":32},{"$f":"COLUMN()","v":33},{"$f":"COLUMN()","v":34},{"$f":"COLUMN()","v":35},{"$f":"COLUMN()","v":36},{"$f":"COLUMN()","v":37},{"$f":"COLUMN()","v":38},{"$f":"COLUMN()","v":39},{"$f":"COLUMN()","v":40},{"$f":"COLUMN()","v":41},{"$f":"COLUMN()","v":42},{"$f":"COLUMN()","v":43},{"$f":"COLUMN()","v":44},{"$f":"COLUMN()","v":45},{"$f":"COLUMN()","v":46},{"$f":"COLUMN()","v":47},{"$f":"COLUMN()","v":48},{"$f":"COLUMN()","v":49},{"$f":"COLUMN()","v":50}]
[{"$f":"IF(Cover!$G$5=\"\",\"\",Cover!$G$5)","v":""},null,null,null,null,"2014-01-31","2014-02-28","2014-03-31","2014-04-30","2014-05-31","2014-06-30","2014-06-30",{"$f":"+L2","v":"2014-06-30"},"Reviewer's","2014-07-31","2014-07-31",{"$f":"+P2","v":"2014-07-31"},"Reviewer's","2014-08-31","2014-08-31",{"$f":"+T2","v":"2014-08-31"},"Reviewer's","2014-09-30","2014-09-30",{"$f":"+X2","v":"2014-09-30"},"Reviewer's","2014-10-31","2014-10-31",{"$f":"+AB2","v":"2014-10-31"},"Reviewer's","2014-11-30","2014-11-30",{"$f":"+AF2","v":"2014-11-30"},"Reviewer's","2014-12-31","2014-12-31",{"$f":"+AJ2","v":"2014-12-31"},"Reviewer's","2015-01-31","2015-01-31",{"$f":"+AN2","v":"2015-01-31"},"Reviewer's","2015-02-28","2015-02-28",{"$f":"+AR2","v":"2015-02-28"},"Reviewer's","2015-03-31","2015-03-31",{"$f":"+AV2","v":"2015-03-31"},"Reviewer's"]
["REVENUE AND EXPENSES",null,null,"Definition Help",null,"Actual","Actual","Actual","Actual","Actual","Projected","Actual","Difference","Adjustment","Projected","Actual","Difference","Adjustment","Projected","Actual","Difference","Adjustment","Projected","Actual","Difference","Adjustment","Projected","Actual","Difference","Adjustment","Projected","Actual","Difference","Adjustment","Projected","Actual","Difference","Adjustment","Projected","Actual","Difference","Adjustment","Projected","Actual","Difference","Adjustment","Projected","Actual","Difference","Adjustment"]
["Revenue"]
[null,"Patient Service Revenue"]
[null,null,"Inpatient revenue",null,null,null,null,null,null,null,null,null,{"$f":"+L6-K6","v":0},null,null,null,{"$f":"+P6-O6","v":0},null,null,null,{"$f":"+T6-S6","v":0},null,null,null,{"$f":"+X6-W6","v":0},null,null,null,{"$f":"+AB6-AA6","v":0},null,null,null,{"$f":"+AF6-AE6","v":0},null,null,null,{"$f":"+AJ6-AI6","v":0},null,null,null,{"$f":"+AN6-AM6","v":0},null,null,null,{"$f":"+AR6-AQ6","v":0},null,null,null,{"$f":"+AV6-AU6","v":0}]
[null,null,"Outpatient revenue",null,null,null,null,null,null,null,null,null,{"$f":"+L7-K7","v":0},null,null,null,{"$f":"+P7-O7","v":0},null,null,null,{"$f":"+T7-S7","v":0},null,null,null,{"$f":"+X7-W7","v":0},null,null,null,{"$f":"+AB7-AA7","v":0},null,null,null,{"$f":"+AF7-AE7","v":0},null,null,null,{"$f":"+AJ7-AI7","v":0},null,null,null,{"$f":"+AN7-AM7","v":0},null,null,null,{"$f":"+AR7-AQ7","v":0},null,null,null,{"$f":"+AV7-AU7","v":0}]
[null,null,"Provision for bad debt (Negative)",null,null,null,null,null,null,null,null,null,0,null,null,null,0,null,null,null,0,null,null,null,0,null,null,null,0,null,null,null,0,null,null,null,0,null,null,null,0,null,null,null,0,null,null,null,0]
[null,"Net patient revenue - Less provision for bad debts",null,null,null,{"$f":"+SUM(F6:F8)","v":0},{"$f":"+SUM(G6:G8)","v":0},0,0,0,0,0,0,null,0,0,0,null,0,0,0,null,0,0,0,null,0,0,0,null,0,0,0,null,0,0,0,null,0,0,0,null,0,0,0,null,0,0,0]
[null,"Other operating revenue",null,null,null,null,null,null,null,null,null,null,0,null,null,null,0,null,null,null,0,null,null,null,0,null,null,null,0,null,null,null,0,null,null,null,0,null,null,null,0,null,null,null,0,null,null,null,0]
{"$rows_left_out":28}
{"sheet":"Statistics Summary","index":4,"n_rows":55,"n_cols":40,"rows_kept":55,"cut":false,"hidden":false,"merged":[[42,1,42,2],[43,1,43,2],[48,1,48,2]]}
["←","Statement of Statistics Inpatient and Outpatient",null,{"$f":"COLUMN()","v":4},null,{"$f":"COLUMN()","v":6},{"$f":"COLUMN()","v":7},{"$f":"COLUMN()","v":8},{"$f":"COLUMN()","v":9},{"$f":"COLUMN()","v":10},{"$f":"COLUMN()","v":11},{"$f":"COLUMN()","v":12},{"$f":"COLUMN()","v":13},{"$f":"COLUMN()","v":14},{"$f":"COLUMN()","v":15},{"$f":"COLUMN()","v":16},{"$f":"COLUMN()","v":17},{"$f":"COLUMN()","v":18},{"$f":"COLUMN()","v":19},{"$f":"COLUMN()","v":20},{"$f":"COLUMN()","v":21},{"$f":"COLUMN()","v":22},{"$f":"COLUMN()","v":23},{"$f":"COLUMN()","v":24},{"$f":"COLUMN()","v":25},{"$f":"COLUMN()","v":26},{"$f":"COLUMN()","v":27},{"$f":"COLUMN()","v":28},{"$f":"COLUMN()","v":29},{"$f":"COLUMN()","v":30},{"$f":"COLUMN()","v":31},{"$f":"COLUMN()","v":32},{"$f":"COLUMN()","v":33},{"$f":"COLUMN()","v":34},{"$f":"COLUMN()","v":35},{"$f":"COLUMN()","v":36},{"$f":"COLUMN()","v":37},{"$f":"COLUMN()","v":38},{"$f":"COLUMN()","v":39},{"$f":"COLUMN()","v":40}]
[{"$f":"IF(Cover!$G$5=\"\",\"\",Cover!$G$5)","v":""},null,null,null,null,"2014-01-31","2014-02-28","2014-03-31","2014-04-30","2014-05-31","2014-06-30","2014-06-30",{"$f":"+L2","v":"2014-06-30"},"2014-07-31","2014-07-31",{"$f":"+O2","v":"2014-07-31"},"2014-08-31","2014-08-31",{"$f":"+R2","v":"2014-08-31"},"2014-09-30","2014-09-30",{"$f":"+U2","v":"2014-09-30"},"2014-10-31","2014-10-31",{"$f":"+X2","v":"2014-10-31"},"2014-11-30","2014-11-30",{"$f":"+AA2","v":"2014-11-30"},"2014-12-31","2014-12-31",{"$f":"+AD2","v":"2014-12-31"},"2015-01-31","2015-01-31",{"$f":"+AG2","v":"2015-01-31"},"2015-02-28","2015-02-28",{"$f":"+AJ2","v":"2015-02-28"},"2015-03-31","2015-03-31",{"$f":"+AM2","v":"2015-03-31"}]
["STATISTICS SUMMARY",null,null,null,null,"Actual","Actual","Actual","Actual","Actual","Projected","Actual","Difference","Projected","Actual","Difference","Projected","Actual","Difference","Projected","Actual","Difference","Projected","Actual","Difference","Projected","Actual","Difference","Projected","Actual","Difference","Projected","Actual","Difference","Projected","Actual","Difference","Projected","Actual","Difference"]
["Inpatient Statistics"]
[null,"Discharges"]
[null,null,"Medicine",null,null,null,null,null,null,null,null,null,{"$f":"+L6-K6","v":0},null,null,{"$f":"+O6-N6","v":0},null,null,{"$f":"+R6-Q6","v":0},null,null,{"$f":"+U6-T6","v":0},null,null,{"$f":"+X6-W6","v":0},null,null,{"$f":"+AA6-Z6","v":0},null,null,{"$f":"+AD6-AC6","v":0},null,null,{"$f":"+AG6-AF6","v":0},null,null,{"$f":"+AJ6-AI6","v":0},null,null,{"$f":"+AM6-AL6","v":0}]
[null,null,"Surgery",null,null,null,null,null,null,null,null,null,{"$f":"+L7-K7","v":0},null,null,{"$f":"+O7-N7","v":0},null,null,{"$f":"+R7-Q7","v":0},null,null,{"$f":"+U7-T7","v":0},null,null,{"$f":"+X7-W7","v":0},null,null,{"$f":"+AA7-Z7","v":0},null,null,{"$f":"+AD7-AC7","v":0},null,null,{"$f":"+AG7-AF7","v":0},null,null,{"$f":"+AJ7-AI7","v":0},null,null,{"$f":"+AM7-AL7","v":0}]
[null,null,"GYN",null,null,null,null,null,null,null,null,null,0,null,null,0,null,null,0,null,null,0,null,null,0,null,null,0,null,null,0,null,null,0,null,null,0,null,null,0]
[null,null,"Pediatrics",null,null,null,null,null,null,null,null,null,{"$f":"+L9-K9","v":0},null,null,{"$f":"+O9-N9","v":0},null,null,{"$f":"+R9-Q9","v":0},null,null,{"$f":"+U9-T9","v":0},null,null,{"$f":"+X9-W9","v":0},null,null,{"$f":"+AA9-Z9","v":0},null,null,{"$f":"+AD9-AC9","v":0},null,null,{"$f":"+AG9-AF9","v":0},null,null,{"$f":"+AJ9-AI9","v":0},null,null,{"$f":"+AM9-AL9","v":0}]
[null,null,"OB",null,null,null,null,null,null,null,null,null,{"$f":"+L10-K10","v":0},null,null,{"$f":"+O10-N10","v":0},null,null,{"$f":"+R10-Q10","v":0},null,null,{"$f":"+U10-T10","v":0},null,null,{"$f":"+X10-W10","v":0},null,null,{"$f":"+AA10-Z10","v":0},null,null,{"$f":"+AD10-AC10","v":0},null,null,{"$f":"+AG10-AF10","v":0},null,null,{"$f":"+AJ10-AI10","v":0},null,null,{"$f":"+AM10-AL10","v":0}]
{"$rows_left_out":46}
{"sheet":"Definitions","index":5,"n_rows":68,"n_cols":29,"rows_kept":68,"cut":false,"hidden":false,"merged":[[38,1,38,28],[32,1,32,28],[33,1,33,28],[34,1,34,28],[35,1,35,28],[37,1,37,28],[27,1,27,28],[28,1,28,28],[29,1,29,28],[30,1,30,28],[31,1,31,28],[20,1,20,28],[22,1,22,28],[23,1,23,28],[24,1,24,28],[26,1,26,28],[14,1,14,28],[15,1,15,28],[16,1,16,28],[18,1,18,28],[19,1,19,28],[1,0,5,28],[12,1,12,28],[13,1,13,28],[9,1,9,28],[10,1,10,28],[11,1,11,28]]}
["←","Definitions of Terms",null,null,null,{"$f":"COLUMN()","v":6},{"$f":"COLUMN()","v":7},{"$f":"COLUMN()","v":8},{"$f":"COLUMN()","v":9},{"$f":"COLUMN()","v":10},{"$f":"COLUMN()","v":11},{"$f":"COLUMN()","v":12},{"$f":"COLUMN()","v":13},{"$f":"COLUMN()","v":14},{"$f":"COLUMN()","v":15},{"$f":"COLUMN()","v":16},{"$f":"COLUMN()","v":17},{"$f":"COLUMN()","v":18},{"$f":"COLUMN()","v":19},{"$f":"COLUMN()","v":20},{"$f":"COLUMN()","v":21},{"$f":"COLUMN()","v":22},{"$f":"COLUMN()","v":23},{"$f":"COLUMN()","v":24},{"$f":"COLUMN()","v":25},{"$f":"COLUMN()","v":26},{"$f":"COLUMN()","v":27},{"$f":"COLUMN()","v":28},{"$f":"COLUMN()","v":29}]
["The definitions for the following accounts should be followed when filling out the application and all submissions to the New York State Department of Health. The common set of account principals, standards and procedures that companies, hospitals, and facilities use to compile their financial statements.  GAAP are a combination of authoritative standards, prouncements, opinions and FASB Interpretations under the Statement on Auditing Standards (SAS #69), and simply the commonly accepted ways of recording and reporting accounting information.  (Please be advised that any distortions or unscrupulous deviations from GAAP will be heavily scrutinized and may cause the discontinuation of grant funds.)"]
[]
[]
[]
[]
[]
["Balance Sheet Accounts:"]
["Current Assets"]
[null,"Cash and Cash Equivalents - It is the most liquid asset, which includes currency, deposit accounts, and negotiable instruments."]
{"$rows_left_out":59}
{"sheet":"Explanation Sheet","index":6,"n_rows":2,"n_cols":2,"rows_kept":2,"cut":false,"hidden":false,"merged":[]}
[]
[null,"Use this sheet to provide any additional explanations regarding information in the previous sheets"]

{"sheet":"Reconciliation","index":7,"n_rows":37,"n_cols":11,"rows_kept":37,"cut":false,"hidden":true,"merged":[[32,2,32,4],[33,2,33,4],[34,2,34,4],[35,2,35,4],[36,2,36,4],[31,2,31,4],[26,2,26,4],[27,2,27,4],[28,2,28,4],[29,2,29,4],[30,2,30,4]]}
[]
[null,null,"Reconciliation Sheet"]
[]
[null,"2014-06-30","2014-07-31","2014-08-31","2014-09-30","2014-10-31","2014-11-30","2014-12-31","2015-01-31","2015-02-28","2015-03-31"]
["Total IAAF Award Left",null,{"$f":"B21","v":0},0,0,0,0,0,0,0,0]
["Projected Monthly IAAF Award Need"]
["Projected Monthly Award plus last month's adjustment",{"$f":"B6","v":0},{"$f":"C6+B17","v":0},0,0,0,0,0,0,0,0]
[]
["Excess Revenue Over Expenses Less Depreciation",{"$f":"'Income Statement'!L36","v":0},{"$f":"'Income Statement'!P36","v":0},{"$f":"'Income Statement'!T36","v":0},{"$f":"'Income Statement'!X36","v":0},{"$f":"'Income Statement'!AB36","v":0},{"$f":"'Income Statement'!AF36","v":0},{"$f":"'Income Statement'!AJ36","v":0},{"$f":"'Income Statement'!AN36","v":0},{"$f":"'Income Statement'!AR36","v":0},{"$f":"'Income Statement'!AV36","v":0}]
["Actual Monthly IAAF Award Need",{"$f":"IF(B9>0,0,(IF(ABS(B9)<B7,ABS(B9),B7)))","v":0},0,0,0,0,0,0,0,0,0]
{"$rows_left_out":27}